{"text_format":"1","workbook":"xlsx","n_sheets":3,"sheets":["Erfassung","Feiertage","Arbeitszeiten"],"not_rendered":{"charts":0,"images":0,"macros":0,"external_links":0,"defined_names":48,"comments":2,"pivot_tables":0},"unopened":[],"bounds":{"document_bytes":16777216,"sheet_cells":100000,"rows_first":2000,"rows_last":500,"rows_between":2000,"halvings":0,"cell_chars":16384,"cell_head_chars":4096},"cells_cut":0,"cells_raw":0,"read":"whole","date_system":"1900"}

{"sheet":"Erfassung","index":0,"n_rows":14,"n_cols":16,"rows_kept":14,"cut":false,"hidden":false,"merged":[[9,1,11,2],[9,4,11,15],[13,1,15,1]]}
["Jahr","Wochenarbeitszeit","Prozent alle Mt","Ferientage im Jahr","Jan","Feb","März","Apr","Mai","Juni","Juli","Aug","Sept","Okt","Nov","Dez"]
[2024,42,1,30,{"$f":"$C$2","v":1},{"$f":"$C$2","v":1},1,1,1,1,1,1,1,1,1,1]
[]
[]
[null,null,null,null,null,null,null,null,null,"zu den Feiertagen/Ferien"]
[]
[null,null,null,null,null,null,null,null,null,"zu den Arbeitszeiten"]
[]
[]
[null,"im sk-app unter Administration, Arbeitszeiten eintragen:",null,null,"im sk-app unter Administration+2021, die Stunden eintragen:"]
{"$rows_left_out":5}
{"sheet":"Feiertage","index":1,"n_rows":10,"n_cols":5,"rows_kept":10,"cut":false,"hidden":false,"merged":[[1,4,2,7]]}
["Datum","Feiertag"]
["2024-01-01","Neujahrstag",null,null,"zu den Resultaten"]
["2024-01-02","Berchtoldstag (statt 1. Mai = gleiches Resultat)"]
["2024-03-29","Karfreitag"]
["2024-04-01","Ostermontag"]
["2024-05-09","Auffahrt"]
["2024-05-20","Pfingstmontag"]
["2024-08-01","Nationalfeiertag Schweiz"]
["2024-12-25","Weihnachten"]
["2024-12-26","Stephanstag"]
{"$rows_left_out":1}
{"sheet":"Arbeitszeiten","index":2,"n_rows":32,"n_cols":37,"rows_kept":32,"cut":false,"hidden":false,"merged":[[1,35,1,36]]}
["Arbeitszeiten"]
[2024,1,2,3,4,5,6,7,8,9,10,11,12,13,14,15,16,17,18,19,20,21,22,23,24,25,26,27,28,29,30,31,"F Tage","Ferien h","A-Tage","Monatssaldo"]
[null,"2024-01-01",{"$f":"B3+1","v":"2024-01-02"},{"$f":"C3+1","v":"2024-01-03"},"2024-01-04","2024-01-05","2024-01-06","2024-01-07","2024-01-08","2024-01-09","2024-01-10","2024-01-11","2024-01-12","2024-01-13","2024-01-14","2024-01-15","2024-01-16","2024-01-17","2024-01-18","2024-01-19","2024-01-20","2024-01-21","2024-01-22","2024-01-23","2024-01-24","2024-01-25","2024-01-26","2024-01-27","2024-01-28","2024-01-29","2024-01-30","2024-01-31"]
["Januar",{"$f":"IF(ISNA(VLOOKUP(B3,Feiertage!$A:$C,3,FALSE)),IF(OR(WEEKDAY(B3)=1,WEEKDAY(B3)=7),\"\",Erfassung!$B$2*SUM(Erfassung!$E$2:$E$2)/5),\"F\")","v":"F"},{"$f":"IF(ISNA(VLOOKUP(C3,Feiertage!$A:$C,3,FALSE)),IF(OR(WEEKDAY(C3)=1,WEEKDAY(C3)=7),\"\",Erfassung!$B$2*SUM(Erfassung!$E$2:$E$2)/5),\"F\")","v":"F"},{"$f":"IF(ISNA(VLOOKUP(D3,Feiertage!$A:$C,3,FALSE)),IF(OR(WEEKDAY(D3)=1,WEEKDAY(D3)=7),\"\",Erfassung!$B$2*SUM(Erfassung!$E$2:$E$2)/5),\"F\")","v":8.4},{"$f":"IF(ISNA(VLOOKUP(E3,Feiertage!$A:$C,3,FALSE)),IF(OR(WEEKDAY(E3)=1,WEEKDAY(E3)=7),\"\",Erfassung!$B$2*SUM(Erfassung!$E$2:$E$2)/5),\"F\")","v":8.4},{"$f":"IF(ISNA(VLOOKUP(F3,Feiertage!$A:$C,3,FALSE)),IF(OR(WEEKDAY(F3)=1,WEEKDAY(F3)=7),\"\",Erfassung!$B$2*SUM(Erfassung!$E$2:$E$2)/5),\"F\")","v":8.4},{"$f":"IF(ISNA(VLOOKUP(G3,Feiertage!$A:$C,3,FALSE)),IF(OR(WEEKDAY(G3)=1,WEEKDAY(G3)=7),\"\",Erfassung!$B$2*SUM(Erfassung!$E$2:$E$2)/5),\"F\")","v":""},{"$f":"IF(ISNA(VLOOKUP(H3,Feiertage!$A:$C,3,FALSE)),IF(OR(WEEKDAY(H3)=1,WEEKDAY(H3)=7),\"\",Erfassung!$B$2*SUM(Erfassung!$E$2:$E$2)/5),\"F\")","v":""},{"$f":"IF(ISNA(VLOOKUP(I3,Feiertage!$A:$C,3,FALSE)),IF(OR(WEEKDAY(I3)=1,WEEKDAY(I3)=7),\"\",Erfassung!$B$2*SUM(Erfassung!$E$2:$E$2)/5),\"F\")","v":8.4},{"$f":"IF(ISNA(VLOOKUP(J3,Feiertage!$A:$C,3,FALSE)),IF(OR(WEEKDAY(J3)=1,WEEKDAY(J3)=7),\"\",Erfassung!$B$2*SUM(Erfassung!$E$2:$E$2)/5),\"F\")","v":8.4},{"$f":"IF(ISNA(VLOOKUP(K3,Feiertage!$A:$C,3,FALSE)),IF(OR(WEEKDAY(K3)=1,WEEKDAY(K3)=7),\"\",Erfassung!$B$2*SUM(Erfassung!$E$2:$E$2)/5),\"F\")","v":8.4},{"$f":"IF(ISNA(VLOOKUP(L3,Feiertage!$A:$C,3,FALSE)),IF(OR(WEEKDAY(L3)=1,WEEKDAY(L3)=7),\"\",Erfassung!$B$2*SUM(Erfassung!$E$2:$E$2)/5),\"F\")","v":8.4},{"$f":"IF(ISNA(VLOOKUP(M3,Feiertage!$A:$C,3,FALSE)),IF(OR(WEEKDAY(M3)=1,WEEKDAY(M3)=7),\"\",Erfassung!$B$2*SUM(Erfassung!$E$2:$E$2)/5),\"F\")","v":8.4},{"$f":"IF(ISNA(VLOOKUP(N3,Feiertage!$A:$C,3,FALSE)),IF(OR(WEEKDAY(N3)=1,WEEKDAY(N3)=7),\"\",Erfassung!$B$2*SUM(Erfassung!$E$2:$E$2)/5),\"F\")","v":""},{"$f":"IF(ISNA(VLOOKUP(O3,Feiertage!$A:$C,3,FALSE)),IF(OR(WEEKDAY(O3)=1,WEEKDAY(O3)=7),\"\",Erfassung!$B$2*SUM(Erfassung!$E$2:$E$2)/5),\"F\")","v":""},{"$f":"IF(ISNA(VLOOKUP(P3,Feiertage!$A:$C,3,FALSE)),IF(OR(WEEKDAY(P3)=1,WEEKDAY(P3)=7),\"\",Erfassung!$B$2*SUM(Erfassung!$E$2:$E$2)/5),\"F\")","v":8.4},{"$f":"IF(ISNA(VLOOKUP(Q3,Feiertage!$A:$C,3,FALSE)),IF(OR(WEEKDAY(Q3)=1,WEEKDAY(Q3)=7),\"\",Erfassung!$B$2*SUM(Erfassung!$E$2:$E$2)/5),\"F\")","v":8.4},{"$f":"IF(ISNA(VLOOKUP(R3,Feiertage!$A:$C,3,FALSE)),IF(OR(WEEKDAY(R3)=1,WEEKDAY(R3)=7),\"\",Erfassung!$B$2*SUM(Erfassung!$E$2:$E$2)/5),\"F\")","v":8.4},{"$f":"IF(ISNA(VLOOKUP(S3,Feiertage!$A:$C,3,FALSE)),IF(OR(WEEKDAY(S3)=1,WEEKDAY(S3)=7),\"\",Erfassung!$B$2*SUM(Erfassung!$E$2:$E$2)/5),\"F\")","v":8.4},{"$f":"IF(ISNA(VLOOKUP(T3,Feiertage!$A:$C,3,FALSE)),IF(OR(WEEKDAY(T3)=1,WEEKDAY(T3)=7),\"\",Erfassung!$B$2*SUM(Erfassung!$E$2:$E$2)/5),\"F\")","v":8.4},{"$f":"IF(ISNA(VLOOKUP(U3,Feiertage!$A:$C,3,FALSE)),IF(OR(WEEKDAY(U3)=1,WEEKDAY(U3)=7),\"\",Erfassung!$B$2*SUM(Erfassung!$E$2:$E$2)/5),\"F\")","v":""},{"$f":"IF(ISNA(VLOOKUP(V3,Feiertage!$A:$C,3,FALSE)),IF(OR(WEEKDAY(V3)=1,WEEKDAY(V3)=7),\"\",Erfassung!$B$2*SUM(Erfassung!$E$2:$E$2)/5),\"F\")","v":""},{"$f":"IF(ISNA(VLOOKUP(W3,Feiertage!$A:$C,3,FALSE)),IF(OR(WEEKDAY(W3)=1,WEEKDAY(W3)=7),\"\",Erfassung!$B$2*SUM(Erfassung!$E$2:$E$2)/5),\"F\")","v":8.4},{"$f":"IF(ISNA(VLOOKUP(X3,Feiertage!$A:$C,3,FALSE)),IF(OR(WEEKDAY(X3)=1,WEEKDAY(X3)=7),\"\",Erfassung!$B$2*SUM(Erfassung!$E$2:$E$2)/5),\"F\")","v":8.4},{"$f":"IF(ISNA(VLOOKUP(Y3,Feiertage!$A:$C,3,FALSE)),IF(OR(WEEKDAY(Y3)=1,WEEKDAY(Y3)=7),\"\",Erfassung!$B$2*SUM(Erfassung!$E$2:$E$2)/5),\"F\")","v":8.4},{"$f":"IF(ISNA(VLOOKUP(Z3,Feiertage!$A:$C,3,FALSE)),IF(OR(WEEKDAY(Z3)=1,WEEKDAY(Z3)=7),\"\",Erfassung!$B$2*SUM(Erfassung!$E$2:$E$2)/5),\"F\")","v":8.4},{"$f":"IF(ISNA(VLOOKUP(AA3,Feiertage!$A:$C,3,FALSE)),IF(OR(WEEKDAY(AA3)=1,WEEKDAY(AA3)=7),\"\",Erfassung!$B$2*SUM(Erfassung!$E$2:$E$2)/5),\"F\")","v":8.4},{"$f":"IF(ISNA(VLOOKUP(AB3,Feiertage!$A:$C,3,FALSE)),IF(OR(WEEKDAY(AB3)=1,WEEKDAY(AB3)=7),\"\",Erfassung!$B$2*SUM(Erfassung!$E$2:$E$2)/5),\"F\")","v":""},{"$f":"IF(ISNA(VLOOKUP(AC3,Feiertage!$A:$C,3,FALSE)),IF(OR(WEEKDAY(AC3)=1,WEEKDAY(AC3)=7),\"\",Erfassung!$B$2*SUM(Erfassung!$E$2:$E$2)/5),\"F\")","v":""},{"$f":"IF(ISNA(VLOOKUP(AD3,Feiertage!$A:$C,3,FALSE)),IF(OR(WEEKDAY(AD3)=1,WEEKDAY(AD3)=7),\"\",Erfassung!$B$2*SUM(Erfassung!$E$2:$E$2)/5),\"F\")","v":8.4},{"$f":"IF(ISNA(VLOOKUP(AE3,Feiertage!$A:$C,3,FALSE)),IF(OR(WEEKDAY(AE3)=1,WEEKDAY(AE3)=7),\"\",Erfassung!$B$2*SUM(Erfassung!$E$2:$E$2)/5),\"F\")","v":8.4},{"$f":"IF(ISNA(VLOOKUP(AF3,Feiertage!$A:$C,3,FALSE)),IF(OR(WEEKDAY(AF3)=1,WEEKDAY(AF3)=7),\"\",Erfassung!$B$2*SUM(Erfassung!$E$2:$E$2)/5),\"F\")","v":8.4},{"$f":"Erfassung!$D$2/12","v":2.5},{"$f":"IF(AG4=\"\",\"\",AG4*(Erfassung!$B$2/5)*SUM(Erfassung!E$2))","v":21},{"$f":"COUNT(B4:AF4,\"<0.1\")","v":21},{"$f":"SUM(B4:AF4)","v":176.40000000000006},"Januar"]
[null,{"$f":"AF3+1","v":"2024-02-01"},{"$f":"B5+1","v":"2024-02-02"},"2024-02-03","2024-02-04","2024-02-05","2024-02-06","2024-02-07","2024-02-08","2024-02-09","2024-02-10","2024-02-11","2024-02-12","2024-02-13","2024-02-14","2024-02-15","2024-02-16","2024-02-17","2024-02-18","2024-02-19","2024-02-20","2024-02-21","2024-02-22","2024-02-23","2024-02-24","2024-02-25","2024-02-26","2024-02-27","2024-02-28","2024-02-29",null,null,{"$f":"Erfassung!$D$2/12","v":2.5},{"$f":"IF(AG5=\"\",\"\",AG5*(Erfassung!$B$2/5)*SUM(Erfassung!E$2))","v":21}]
["Februar",{"$f":"IF(ISNA(VLOOKUP(B5,Feiertage!$A:$C,3,FALSE)),IF(OR(WEEKDAY(B5)=1,WEEKDAY(B5)=7),\"\",Erfassung!$B$2*SUM(Erfassung!$F2:$F2)/5),\"F\")","v":8.4},{"$f":"IF(ISNA(VLOOKUP(C5,Feiertage!$A:$C,3,FALSE)),IF(OR(WEEKDAY(C5)=1,WEEKDAY(C5)=7),\"\",Erfassung!$B$2*SUM(Erfassung!$F2:$F2)/5),\"F\")","v":8.4},{"$f":"IF(ISNA(VLOOKUP(D5,Feiertage!$A:$C,3,FALSE)),IF(OR(WEEKDAY(D5)=1,WEEKDAY(D5)=7),\"\",Erfassung!$B$2*SUM(Erfassung!$F2:$F2)/5),\"F\")","v":""},{"$f":"IF(ISNA(VLOOKUP(E5,Feiertage!$A:$C,3,FALSE)),IF(OR(WEEKDAY(E5)=1,WEEKDAY(E5)=7),\"\",Erfassung!$B$2*SUM(Erfassung!$F2:$F2)/5),\"F\")","v":""},{"$f":"IF(ISNA(VLOOKUP(F5,Feiertage!$A:$C,3,FALSE)),IF(OR(WEEKDAY(F5)=1,WEEKDAY(F5)=7),\"\",Erfassung!$B$2*SUM(Erfassung!$F2:$F2)/5),\"F\")","v":8.4},{"$f":"IF(ISNA(VLOOKUP(G5,Feiertage!$A:$C,3,FALSE)),IF(OR(WEEKDAY(G5)=1,WEEKDAY(G5)=7),\"\",Erfassung!$B$2*SUM(Erfassung!$F2:$F2)/5),\"F\")","v":8.4},{"$f":"IF(ISNA(VLOOKUP(H5,Feiertage!$A:$C,3,FALSE)),IF(OR(WEEKDAY(H5)=1,WEEKDAY(H5)=7),\"\",Erfassung!$B$2*SUM(Erfassung!$F2:$F2)/5),\"F\")","v":8.4},{"$f":"IF(ISNA(VLOOKUP(I5,Feiertage!$A:$C,3,FALSE)),IF(OR(WEEKDAY(I5)=1,WEEKDAY(I5)=7),\"\",Erfassung!$B$2*SUM(Erfassung!$F2:$F2)/5),\"F\")","v":8.4},{"$f":"IF(ISNA(VLOOKUP(J5,Feiertage!$A:$C,3,FALSE)),IF(OR(WEEKDAY(J5)=1,WEEKDAY(J5)=7),\"\",Erfassung!$B$2*SUM(Erfassung!$F2:$F2)/5),\"F\")","v":8.4},{"$f":"IF(ISNA(VLOOKUP(K5,Feiertage!$A:$C,3,FALSE)),IF(OR(WEEKDAY(K5)=1,WEEKDAY(K5)=7),\"\",Erfassung!$B$2*SUM(Erfassung!$F2:$F2)/5),\"F\")","v":""},{"$f":"IF(ISNA(VLOOKUP(L5,Feiertage!$A:$C,3,FALSE)),IF(OR(WEEKDAY(L5)=1,WEEKDAY(L5)=7),\"\",Erfassung!$B$2*SUM(Erfassung!$F2:$F2)/5),\"F\")","v":""},{"$f":"IF(ISNA(VLOOKUP(M5,Feiertage!$A:$C,3,FALSE)),IF(OR(WEEKDAY(M5)=1,WEEKDAY(M5)=7),\"\",Erfassung!$B$2*SUM(Erfassung!$F2:$F2)/5),\"F\")","v":8.4},{"$f":"IF(ISNA(VLOOKUP(N5,Feiertage!$A:$C,3,FALSE)),IF(OR(WEEKDAY(N5)=1,WEEKDAY(N5)=7),\"\",Erfassung!$B$2*SUM(Erfassung!$F2:$F2)/5),\"F\")","v":8.4},{"$f":"IF(ISNA(VLOOKUP(O5,Feiertage!$A:$C,3,FALSE)),IF(OR(WEEKDAY(O5)=1,WEEKDAY(O5)=7),\"\",Erfassung!$B$2*SUM(Erfassung!$F2:$F2)/5),\"F\")","v":8.4},{"$f":"IF(ISNA(VLOOKUP(P5,Feiertage!$A:$C,3,FALSE)),IF(OR(WEEKDAY(P5)=1,WEEKDAY(P5)=7),\"\",Erfassung!$B$2*SUM(Erfassung!$F2:$F2)/5),\"F\")","v":8.4},{"$f":"IF(ISNA(VLOOKUP(Q5,Feiertage!$A:$C,3,FALSE)),IF(OR(WEEKDAY(Q5)=1,WEEKDAY(Q5)=7),\"\",Erfassung!$B$2*SUM(Erfassung!$F2:$F2)/5),\"F\")","v":8.4},{"$f":"IF(ISNA(VLOOKUP(R5,Feiertage!$A:$C,3,FALSE)),IF(OR(WEEKDAY(R5)=1,WEEKDAY(R5)=7),\"\",Erfassung!$B$2*SUM(Erfassung!$F2:$F2)/5),\"F\")","v":""},{"$f":"IF(ISNA(VLOOKUP(S5,Feiertage!$A:$C,3,FALSE)),IF(OR(WEEKDAY(S5)=1,WEEKDAY(S5)=7),\"\",Erfassung!$B$2*SUM(Erfassung!$F2:$F2)/5),\"F\")","v":""},{"$f":"IF(ISNA(VLOOKUP(T5,Feiertage!$A:$C,3,FALSE)),IF(OR(WEEKDAY(T5)=1,WEEKDAY(T5)=7),\"\",Erfassung!$B$2*SUM(Erfassung!$F2:$F2)/5),\"F\")","v":8.4},{"$f":"IF(ISNA(VLOOKUP(U5,Feiertage!$A:$C,3,FALSE)),IF(OR(WEEKDAY(U5)=1,WEEKDAY(U5)=7),\"\",Erfassung!$B$2*SUM(Erfassung!$F2:$F2)/5),\"F\")","v":8.4},{"$f":"IF(ISNA(VLOOKUP(V5,Feiertage!$A:$C,3,FALSE)),IF(OR(WEEKDAY(V5)=1,WEEKDAY(V5)=7),\"\",Erfassung!$B$2*SUM(Erfassung!$F2:$F2)/5),\"F\")","v":8.4},{"$f":"IF(ISNA(VLOOKUP(W5,Feiertage!$A:$C,3,FALSE)),IF(OR(WEEKDAY(W5)=1,WEEKDAY(W5)=7),\"\",Erfassung!$B$2*SUM(Erfassung!$F2:$F2)/5),\"F\")","v":8.4},{"$f":"IF(ISNA(VLOOKUP(X5,Feiertage!$A:$C,3,FALSE)),IF(OR(WEEKDAY(X5)=1,WEEKDAY(X5)=7),\"\",Erfassung!$B$2*SUM(Erfassung!$F2:$F2)/5),\"F\")","v":8.4},{"$f":"IF(ISNA(VLOOKUP(Y5,Feiertage!$A:$C,3,FALSE)),IF(OR(WEEKDAY(Y5)=1,WEEKDAY(Y5)=7),\"\",Erfassung!$B$2*SUM(Erfassung!$F2:$F2)/5),\"F\")","v":""},{"$f":"IF(ISNA(VLOOKUP(Z5,Feiertage!$A:$C,3,FALSE)),IF(OR(WEEKDAY(Z5)=1,WEEKDAY(Z5)=7),\"\",Erfassung!$B$2*SUM(Erfassung!$F2:$F2)/5),\"F\")","v":""},{"$f":"IF(ISNA(VLOOKUP(AA5,Feiertage!$A:$C,3,FALSE)),IF(OR(WEEKDAY(AA5)=1,WEEKDAY(AA5)=7),\"\",Erfassung!$B$2*SUM(Erfassung!$F2:$F2)/5),\"F\")","v":8.4},{"$f":"IF(ISNA(VLOOKUP(AB5,Feiertage!$A:$C,3,FALSE)),IF(OR(WEEKDAY(AB5)=1,WEEKDAY(AB5)=7),\"\",Erfassung!$B$2*SUM(Erfassung!$F2:$F2)/5),\"F\")","v":8.4},{"$f":"IF(ISNA(VLOOKUP(AC5,Feiertage!$A:$C,3,FALSE)),IF(OR(WEEKDAY(AC5)=1,WEEKDAY(AC5)=7),\"\",Erfassung!$B$2*SUM(Erfassung!$F2:$F2)/5),\"F\")","v":8.4},{"$f":"IF(ISNA(VLOOKUP(AD5,Feiertage!$A:$C,3,FALSE)),IF(OR(WEEKDAY(AD5)=1,WEEKDAY(AD5)=7),\"\",Erfassung!$B$2*SUM(Erfassung!$F2:$F2)/5),\"F\")","v":8.4},{"$f":"IF(ISNA(VLOOKUP(AE5,Feiertage!$A:$C,3,FALSE)),IF(OR(WEEKDAY(AE5)=1,WEEKDAY(AE5)=7),\"\",Erfassung!$B$2*SUM(Erfassung!$F2:$F2)/5),\"F\")","v":""},{"$f":"IF(ISNA(VLOOKUP(AF5,Feiertage!$A:$C,3,FALSE)),IF(OR(WEEKDAY(AF5)=1,WEEKDAY(AF5)=7),\"\",Erfassung!$B$2*SUM(Erfassung!$F2:$F2)/5),\"F\")","v":""},{"$f":"Erfassung!$D$2/12","v":2.5},{"$f":"IF(AG6=\"\",\"\",AG6*(Erfassung!$B$2/5)*SUM(Erfassung!F$2))","v":21},{"$f":"COUNT(B6:AF6,\"<0.1\")","v":21},{"$f":"SUM(B6:AF6)","v":176.40000000000006},"Februar"]
[null,{"$f":"AD5+1","v":"2024-03-01"},{"$f":"B7+1","v":45353},45354,45355,45356,45357,45358,45359,45360,45361,45362,45363,45364,45365,45366,45367,45368,45369,45370,45371,45372,45373,45374,45375,45376,45377,45378,45379,45380,45381,45382,{"$f":"Erfassung!$D$2/12","v":2.5},{"$f":"IF(AG7=\"\",\"\",AG7*(Erfassung!$B$2/5)*SUM(Erfassung!E$2))","v":21}]
["März",{"$f":"IF(ISNA(VLOOKUP(B7,Feiertage!$A:$C,3,FALSE)),IF(OR(WEEKDAY(B7)=1,WEEKDAY(B7)=7),\"\",Erfassung!$B$2*SUM(Erfassung!$G2:$G2)/5),\"F\")","v":8.4},{"$f":"IF(ISNA(VLOOKUP(C7,Feiertage!$A:$C,3,FALSE)),IF(OR(WEEKDAY(C7)=1,WEEKDAY(C7)=7),\"\",Erfassung!$B$2*SUM(Erfassung!$G2:$G2)/5),\"F\")","v":""},{"$f":"IF(ISNA(VLOOKUP(D7,Feiertage!$A:$C,3,FALSE)),IF(OR(WEEKDAY(D7)=1,WEEKDAY(D7)=7),\"\",Erfassung!$B$2*SUM(Erfassung!$G2:$G2)/5),\"F\")","v":""},{"$f":"IF(ISNA(VLOOKUP(E7,Feiertage!$A:$C,3,FALSE)),IF(OR(WEEKDAY(E7)=1,WEEKDAY(E7)=7),\"\",Erfassung!$B$2*SUM(Erfassung!$G2:$G2)/5),\"F\")","v":8.4},{"$f":"IF(ISNA(VLOOKUP(F7,Feiertage!$A:$C,3,FALSE)),IF(OR(WEEKDAY(F7)=1,WEEKDAY(F7)=7),\"\",Erfassung!$B$2*SUM(Erfassung!$G2:$G2)/5),\"F\")","v":8.4},{"$f":"IF(ISNA(VLOOKUP(G7,Feiertage!$A:$C,3,FALSE)),IF(OR(WEEKDAY(G7)=1,WEEKDAY(G7)=7),\"\",Erfassung!$B$2*SUM(Erfassung!$G2:$G2)/5),\"F\")","v":8.4},{"$f":"IF(ISNA(VLOOKUP(H7,Feiertage!$A:$C,3,FALSE)),IF(OR(WEEKDAY(H7)=1,WEEKDAY(H7)=7),\"\",Erfassung!$B$2*SUM(Erfassung!$G2:$G2)/5),\"F\")","v":8.4},{"$f":"IF(ISNA(VLOOKUP(I7,Feiertage!$A:$C,3,FALSE)),IF(OR(WEEKDAY(I7)=1,WEEKDAY(I7)=7),\"\",Erfassung!$B$2*SUM(Erfassung!$G2:$G2)/5),\"F\")","v":8.4},{"$f":"IF(ISNA(VLOOKUP(J7,Feiertage!$A:$C,3,FALSE)),IF(OR(WEEKDAY(J7)=1,WEEKDAY(J7)=7),\"\",Erfassung!$B$2*SUM(Erfassung!$G2:$G2)/5),\"F\")","v":""},{"$f":"IF(ISNA(VLOOKUP(K7,Feiertage!$A:$C,3,FALSE)),IF(OR(WEEKDAY(K7)=1,WEEKDAY(K7)=7),\"\",Erfassung!$B$2*SUM(Erfassung!$G2:$G2)/5),\"F\")","v":""},{"$f":"IF(ISNA(VLOOKUP(L7,Feiertage!$A:$C,3,FALSE)),IF(OR(WEEKDAY(L7)=1,WEEKDAY(L7)=7),\"\",Erfassung!$B$2*SUM(Erfassung!$G2:$G2)/5),\"F\")","v":8.4},{"$f":"IF(ISNA(VLOOKUP(M7,Feiertage!$A:$C,3,FALSE)),IF(OR(WEEKDAY(M7)=1,WEEKDAY(M7)=7),\"\",Erfassung!$B$2*SUM(Erfassung!$G2:$G2)/5),\"F\")","v":8.4},{"$f":"IF(ISNA(VLOOKUP(N7,Feiertage!$A:$C,3,FALSE)),IF(OR(WEEKDAY(N7)=1,WEEKDAY(N7)=7),\"\",Erfassung!$B$2*SUM(Erfassung!$G2:$G2)/5),\"F\")","v":8.4},{"$f":"IF(ISNA(VLOOKUP(O7,Feiertage!$A:$C,3,FALSE)),IF(OR(WEEKDAY(O7)=1,WEEKDAY(O7)=7),\"\",Erfassung!$B$2*SUM(Erfassung!$G2:$G2)/5),\"F\")","v":8.4},{"$f":"IF(ISNA(VLOOKUP(P7,Feiertage!$A:$C,3,FALSE)),IF(OR(WEEKDAY(P7)=1,WEEKDAY(P7)=7),\"\",Erfassung!$B$2*SUM(Erfassung!$G2:$G2)/5),\"F\")","v":8.4},{"$f":"IF(ISNA(VLOOKUP(Q7,Feiertage!$A:$C,3,FALSE)),IF(OR(WEEKDAY(Q7)=1,WEEKDAY(Q7)=7),\"\",Erfassung!$B$2*SUM(Erfassung!$G2:$G2)/5),\"F\")","v":""},{"$f":"IF(ISNA(VLOOKUP(R7,Feiertage!$A:$C,3,FALSE)),IF(OR(WEEKDAY(R7)=1,WEEKDAY(R7)=7),\"\",Erfassung!$B$2*SUM(Erfassung!$G2:$G2)/5),\"F\")","v":""},{"$f":"IF(ISNA(VLOOKUP(S7,Feiertage!$A:$C,3,FALSE)),IF(OR(WEEKDAY(S7)=1,WEEKDAY(S7)=7),\"\",Erfassung!$B$2*SUM(Erfassung!$G2:$G2)/5),\"F\")","v":8.4},{"$f":"IF(ISNA(VLOOKUP(T7,Feiertage!$A:$C,3,FALSE)),IF(OR(WEEKDAY(T7)=1,WEEKDAY(T7)=7),\"\",Erfassung!$B$2*SUM(Erfassung!$G2:$G2)/5),\"F\")","v":8.4},{"$f":"IF(ISNA(VLOOKUP(U7,Feiertage!$A:$C,3,FALSE)),IF(OR(WEEKDAY(U7)=1,WEEKDAY(U7)=7),\"\",Erfassung!$B$2*SUM(Erfassung!$G2:$G2)/5),\"F\")","v":8.4},{"$f":"IF(ISNA(VLOOKUP(V7,Feiertage!$A:$C,3,FALSE)),IF(OR(WEEKDAY(V7)=1,WEEKDAY(V7)=7),\"\",Erfassung!$B$2*SUM(Erfassung!$G2:$G2)/5),\"F\")","v":8.4},{"$f":"IF(ISNA(VLOOKUP(W7,Feiertage!$A:$C,3,FALSE)),IF(OR(WEEKDAY(W7)=1,WEEKDAY(W7)=7),\"\",Erfassung!$B$2*SUM(Erfassung!$G2:$G2)/5),\"F\")","v":8.4},{"$f":"IF(ISNA(VLOOKUP(X7,Feiertage!$A:$C,3,FALSE)),IF(OR(WEEKDAY(X7)=1,WEEKDAY(X7)=7),\"\",Erfassung!$B$2*SUM(Erfassung!$G2:$G2)/5),\"F\")","v":""},{"$f":"IF(ISNA(VLOOKUP(Y7,Feiertage!$A:$C,3,FALSE)),IF(OR(WEEKDAY(Y7)=1,WEEKDAY(Y7)=7),\"\",Erfassung!$B$2*SUM(Erfassung!$G2:$G2)/5),\"F\")","v":""},{"$f":"IF(ISNA(VLOOKUP(Z7,Feiertage!$A:$C,3,FALSE)),IF(OR(WEEKDAY(Z7)=1,WEEKDAY(Z7)=7),\"\",Erfassung!$B$2*SUM(Erfassung!$G2:$G2)/5),\"F\")","v":8.4},{"$f":"IF(ISNA(VLOOKUP(AA7,Feiertage!$A:$C,3,FALSE)),IF(OR(WEEKDAY(AA7)=1,WEEKDAY(AA7)=7),\"\",Erfassung!$B$2*SUM(Erfassung!$G2:$G2)/5),\"F\")","v":8.4},{"$f":"IF(ISNA(VLOOKUP(AB7,Feiertage!$A:$C,3,FALSE)),IF(OR(WEEKDAY(AB7)=1,WEEKDAY(AB7)=7),\"\",Erfassung!$B$2*SUM(Erfassung!$G2:$G2)/5),\"F\")","v":8.4},{"$f":"IF(ISNA(VLOOKUP(AC7,Feiertage!$A:$C,3,FALSE)),IF(OR(WEEKDAY(AC7)=1,WEEKDAY(AC7)=7),\"\",Erfassung!$B$2*SUM(Erfassung!$G2:$G2)/5),\"F\")","v":8.4},{"$f":"IF(ISNA(VLOOKUP(AD7,Feiertage!$A:$C,3,FALSE)),IF(OR(WEEKDAY(AD7)=1,WEEKDAY(AD7)=7),\"\",Erfassung!$B$2*SUM(Erfassung!$G2:$G2)/5),\"F\")","v":"F"},{"$f":"IF(ISNA(VLOOKUP(AE7,Feiertage!$A:$C,3,FALSE)),IF(OR(WEEKDAY(AE7)=1,WEEKDAY(AE7)=7),\"\",Erfassung!$B$2*SUM(Erfassung!$G2:$G2)/5),\"F\")","v":""},{"$f":"IF(ISNA(VLOOKUP(AF7,Feiertage!$A:$C,3,FALSE)),IF(OR(WEEKDAY(AF7)=1,WEEKDAY(AF7)=7),\"\",Erfassung!$B$2*SUM(Erfassung!$G2:$G2)/5),\"F\")","v":""},{"$f":"Erfassung!$D$2/12","v":2.5},{"$f":"IF(AG8=\"\",\"\",AG8*(Erfassung!$B$2/5)*SUM(Erfassung!G$2))","v":21},{"$f":"COUNT(B8:AF8,\"<0.1\")","v":20},{"$f":"SUM(B8:AF8)","v":168.00000000000006},"März"]
[null,{"$f":"AF7+1","v":"2024-04-01"},{"$f":"B9+1","v":45384},45385,45386,45387,45388,45389,45390,45391,45392,45393,45394,45395,45396,45397,45398,45399,45400,45401,45402,45403,45404,45405,45406,45407,45408,45409,45410,45411,45412,null,{"$f":"Erfassung!$D$2/12","v":2.5},{"$f":"IF(AG9=\"\",\"\",AG9*(Erfassung!$B$2/5)*SUM(Erfassung!E$2))","v":21}]
["April",{"$f":"IF(ISNA(VLOOKUP(B9,Feiertage!$A:$C,3,FALSE)),IF(OR(WEEKDAY(B9)=1,WEEKDAY(B9)=7),\"\",Erfassung!$B$2*SUM(Erfassung!$H2:$H2)/5),\"F\")","v":"F"},{"$f":"IF(ISNA(VLOOKUP(C9,Feiertage!$A:$C,3,FALSE)),IF(OR(WEEKDAY(C9)=1,WEEKDAY(C9)=7),\"\",Erfassung!$B$2*SUM(Erfassung!$H2:$H2)/5),\"F\")","v":8.4},{"$f":"IF(ISNA(VLOOKUP(D9,Feiertage!$A:$C,3,FALSE)),IF(OR(WEEKDAY(D9)=1,WEEKDAY(D9)=7),\"\",Erfassung!$B$2*SUM(Erfassung!$H2:$H2)/5),\"F\")","v":8.4},{"$f":"IF(ISNA(VLOOKUP(E9,Feiertage!$A:$C,3,FALSE)),IF(OR(WEEKDAY(E9)=1,WEEKDAY(E9)=7),\"\",Erfassung!$B$2*SUM(Erfassung!$H2:$H2)/5),\"F\")","v":8.4},{"$f":"IF(ISNA(VLOOKUP(F9,Feiertage!$A:$C,3,FALSE)),IF(OR(WEEKDAY(F9)=1,WEEKDAY(F9)=7),\"\",Erfassung!$B$2*SUM(Erfassung!$H2:$H2)/5),\"F\")","v":8.4},{"$f":"IF(ISNA(VLOOKUP(G9,Feiertage!$A:$C,3,FALSE)),IF(OR(WEEKDAY(G9)=1,WEEKDAY(G9)=7),\"\",Erfassung!$B$2*SUM(Erfassung!$H2:$H2)/5),\"F\")","v":""},{"$f":"IF(ISNA(VLOOKUP(H9,Feiertage!$A:$C,3,FALSE)),IF(OR(WEEKDAY(H9)=1,WEEKDAY(H9)=7),\"\",Erfassung!$B$2*SUM(Erfassung!$H2:$H2)/5),\"F\")","v":""},{"$f":"IF(ISNA(VLOOKUP(I9,Feiertage!$A:$C,3,FALSE)),IF(OR(WEEKDAY(I9)=1,WEEKDAY(I9)=7),\"\",Erfassung!$B$2*SUM(Erfassung!$H2:$H2)/5),\"F\")","v":8.4},{"$f":"IF(ISNA(VLOOKUP(J9,Feiertage!$A:$C,3,FALSE)),IF(OR(WEEKDAY(J9)=1,WEEKDAY(J9)=7),\"\",Erfassung!$B$2*SUM(Erfassung!$H2:$H2)/5),\"F\")","v":8.4},{"$f":"IF(ISNA(VLOOKUP(K9,Feiertage!$A:$C,3,FALSE)),IF(OR(WEEKDAY(K9)=1,WEEKDAY(K9)=7),\"\",Erfassung!$B$2*SUM(Erfassung!$H2:$H2)/5),\"F\")","v":8.4},{"$f":"IF(ISNA(VLOOKUP(L9,Feiertage!$A:$C,3,FALSE)),IF(OR(WEEKDAY(L9)=1,WEEKDAY(L9)=7),\"\",Erfassung!$B$2*SUM(Erfassung!$H2:$H2)/5),\"F\")","v":8.4},{"$f":"IF(ISNA(VLOOKUP(M9,Feiertage!$A:$C,3,FALSE)),IF(OR(WEEKDAY(M9)=1,WEEKDAY(M9)=7),\"\",Erfassung!$B$2*SUM(Erfassung!$H2:$H2)/5),\"F\")","v":8.4},{"$f":"IF(ISNA(VLOOKUP(N9,Feiertage!$A:$C,3,FALSE)),IF(OR(WEEKDAY(N9)=1,WEEKDAY(N9)=7),\"\",Erfassung!$B$2*SUM(Erfassung!$H2:$H2)/5),\"F\")","v":""},{"$f":"IF(ISNA(VLOOKUP(O9,Feiertage!$A:$C,3,FALSE)),IF(OR(WEEKDAY(O9)=1,WEEKDAY(O9)=7),\"\",Erfassung!$B$2*SUM(Erfassung!$H2:$H2)/5),\"F\")","v":""},{"$f":"IF(ISNA(VLOOKUP(P9,Feiertage!$A:$C,3,FALSE)),IF(OR(WEEKDAY(P9)=1,WEEKDAY(P9)=7),\"\",Erfassung!$B$2*SUM(Erfassung!$H2:$H2)/5),\"F\")","v":8.4},{"$f":"IF(ISNA(VLOOKUP(Q9,Feiertage!$A:$C,3,FALSE)),IF(OR(WEEKDAY(Q9)=1,WEEKDAY(Q9)=7),\"\",Erfassung!$B$2*SUM(Erfassung!$H2:$H2)/5),\"F\")","v":8.4},{"$f":"IF(ISNA(VLOOKUP(R9,Feiertage!$A:$C,3,FALSE)),IF(OR(WEEKDAY(R9)=1,WEEKDAY(R9)=7),\"\",Erfassung!$B$2*SUM(Erfassung!$H2:$H2)/5),\"F\")","v":8.4},{"$f":"IF(ISNA(VLOOKUP(S9,Feiertage!$A:$C,3,FALSE)),IF(OR(WEEKDAY(S9)=1,WEEKDAY(S9)=7),\"\",Erfassung!$B$2*SUM(Erfassung!$H2:$H2)/5),\"F\")","v":8.4},{"$f":"IF(ISNA(VLOOKUP(T9,Feiertage!$A:$C,3,FALSE)),IF(OR(WEEKDAY(T9)=1,WEEKDAY(T9)=7),\"\",Erfassung!$B$2*SUM(Erfassung!$H2:$H2)/5),\"F\")","v":8.4},{"$f":"IF(ISNA(VLOOKUP(U9,Feiertage!$A:$C,3,FALSE)),IF(OR(WEEKDAY(U9)=1,WEEKDAY(U9)=7),\"\",Erfassung!$B$2*SUM(Erfassung!$H2:$H2)/5),\"F\")","v":""},{"$f":"IF(ISNA(VLOOKUP(V9,Feiertage!$A:$C,3,FALSE)),IF(OR(WEEKDAY(V9)=1,WEEKDAY(V9)=7),\"\",Erfassung!$B$2*SUM(Erfassung!$H2:$H2)/5),\"F\")","v":""},{"$f":"IF(ISNA(VLOOKUP(W9,Feiertage!$A:$C,3,FALSE)),IF(OR(WEEKDAY(W9)=1,WEEKDAY(W9)=7),\"\",Erfassung!$B$2*SUM(Erfassung!$H2:$H2)/5),\"F\")","v":8.4},{"$f":"IF(ISNA(VLOOKUP(X9,Feiertage!$A:$C,3,FALSE)),IF(OR(WEEKDAY(X9)=1,WEEKDAY(X9)=7),\"\",Erfassung!$B$2*SUM(Erfassung!$H2:$H2)/5),\"F\")","v":8.4},{"$f":"IF(ISNA(VLOOKUP(Y9,Feiertage!$A:$C,3,FALSE)),IF(OR(WEEKDAY(Y9)=1,WEEKDAY(Y9)=7),\"\",Erfassung!$B$2*SUM(Erfassung!$H2:$H2)/5),\"F\")","v":8.4},{"$f":"IF(ISNA(VLOOKUP(Z9,Feiertage!$A:$C,3,FALSE)),IF(OR(WEEKDAY(Z9)=1,WEEKDAY(Z9)=7),\"\",Erfassung!$B$2*SUM(Erfassung!$H2:$H2)/5),\"F\")","v":8.4},{"$f":"IF(ISNA(VLOOKUP(AA9,Feiertage!$A:$C,3,FALSE)),IF(OR(WEEKDAY(AA9)=1,WEEKDAY(AA9)=7),\"\",Erfassung!$B$2*SUM(Erfassung!$H2:$H2)/5),\"F\")","v":8.4},{"$f":"IF(ISNA(VLOOKUP(AB9,Feiertage!$A:$C,3,FALSE)),IF(OR(WEEKDAY(AB9)=1,WEEKDAY(AB9)=7),\"\",Erfassung!$B$2*SUM(Erfassung!$H2:$H2)/5),\"F\")","v":""},{"$f":"IF(ISNA(VLOOKUP(AC9,Feiertage!$A:$C,3,FALSE)),IF(OR(WEEKDAY(AC9)=1,WEEKDAY(AC9)=7),\"\",Erfassung!$B$2*SUM(Erfassung!$H2:$H2)/5),\"F\")","v":""},{"$f":"IF(ISNA(VLOOKUP(AD9,Feiertage!$A:$C,3,FALSE)),IF(OR(WEEKDAY(AD9)=1,WEEKDAY(AD9)=7),\"\",Erfassung!$B$2*SUM(Erfassung!$H2:$H2)/5),\"F\")","v":8.4},{"$f":"IF(ISNA(VLOOKUP(AE9,Feiertage!$A:$C,3,FALSE)),IF(OR(WEEKDAY(AE9)=1,WEEKDAY(AE9)=7),\"\",Erfassung!$B$2*SUM(Erfassung!$H2:$H2)/5),\"F\")","v":8.4},{"$f":"IF(ISNA(VLOOKUP(AF9,Feiertage!$A:$C,3,FALSE)),IF(OR(WEEKDAY(AF9)=1,WEEKDAY(AF9)=7),\"\",Erfassung!$B$2*SUM(Erfassung!$H2:$H2)/5),\"F\")","v":""},{"$f":"Erfassung!$D$2/12","v":2.5},{"$f":"IF(AG10=\"\",\"\",AG10*(Erfassung!$B$2/5)*SUM(Erfassung!H$2))","v":21},{"$f":"COUNT(B10:AF10,\"<0.1\")","v":21},{"$f":"SUM(B10:AF10)","v":176.40000000000006},"April"]
{"$rows_left_out":22}